Fix failing pytests

3 jobs for fix-tests in 4 minutes and 29 seconds (queued for 1 minute and 45 seconds)
latest
Name Stage Failure
failed
pytest Test
FAILED briar-gtk/tests/briar_gtk/test_window.py::test_startup_container_at_init
FAILED briar-gtk/tests/briar_gtk/test_window.py::test_window_actions_at_init
FAILED briar-gtk/tests/briar_gtk/test_window.py::test_window_add_at_init - Ru...
FAILED briar-gtk/tests/briar_gtk/test_window.py::test_show_main_container - R...
FAILED briar-gtk/tests/briar_gtk/test_window.py::test_show_main_shown - Runti...
FAILED briar-gtk/tests/briar_gtk/test_window.py::test_show_main_add - Runtime...
FAILED briar-gtk/tests/briar_gtk/test_window.py::test_show_main_destroy_old
=================== 8 failed, 15 passed, 1 skipped in 1.37s ====================
ERROR: Job failed: exit code 1